Reaction Details
TargetGamma-aminobutyric acid receptor subunit alpha-2
LigandBDBM50000766
Substrate/Competitorn/a
Meas. Tech.ChEMBL_519947 (CHEMBL954626)
Ki 15±n/a nM
Citation Taliani, SCosimelli, BDa Settimo, FMarini, AMLa Motta, CSimorini, FSalerno, SNovellino, EGreco, GCosconati, SMarinelli, LSalvetti, FL'Abbate, GTrasciatti, SMontali, MCosta, BMartini, C Identification of anxiolytic/nonsedative agents among indol-3-ylglyoxylamides acting as functionally selective agonists at the gamma-aminobutyric acid-A (GABAA) alpha2 benzodiazepine receptor. J Med Chem52:3723-34 (2009) 
 
Gamma-aminobutyric acid receptor subunit alpha-2
Name:Gamma-aminobutyric acid receptor subunit alpha-2
Type:Enzyme
Mol. Mass.:51195.57
Organism:Rattus norvegicus (Rat)
Description:P23576
Residue:451
BDBM50000766
NameBDBM50000766
Synonyms:CHEMBL12 US9271961, Diazepam
TypeSmall organic molecule
Emp. Form.C16H13ClN2O
Mol. Mass.284.74
SMILESCN1c2ccc(Cl)cc2C(=NCC1=O)c1ccccc1