Reaction Details
TargetGamma-aminobutyric acid receptor subunit alpha-1
LigandBDBM50268784
Substrate/Competitorn/a
Meas. Tech.ChEMBL_519946 (CHEMBL954625)
Ki 9±n/a nM
Citation Taliani, SCosimelli, BDa Settimo, FMarini, AMLa Motta, CSimorini, FSalerno, SNovellino, EGreco, GCosconati, SMarinelli, LSalvetti, FL'Abbate, GTrasciatti, SMontali, MCosta, BMartini, C Identification of anxiolytic/nonsedative agents among indol-3-ylglyoxylamides acting as functionally selective agonists at the gamma-aminobutyric acid-A (GABAA) alpha2 benzodiazepine receptor. J Med Chem52:3723-34 (2009) 
 
Gamma-aminobutyric acid receptor subunit alpha-1
Name:Gamma-aminobutyric acid receptor subunit alpha-1
Type:Enzyme
Mol. Mass.:51770.21
Organism:Rattus norvegicus (Rat)
Description:P62813
Residue:455
BDBM50268784
NameBDBM50268784
Synonyms:(R)-N-(2,3-dihydro-1H-inden-1-yl)-2-(5-nitro-1H-indol-3-yl)-2-oxoacetamide | CHEMBL521901
TypeSmall organic molecule
Emp. Form.C19H15N3O4
Mol. Mass.349.3401
SMILES[O-][N+](=O)c1ccc2[nH]cc(C(=O)C(=O)N[C@@H]3CCc4ccccc34)c2c1