Reaction Details
TargetC-C chemokine receptor type 2
LigandBDBM50268424
Substrate/Competitorn/a
Meas. Tech.ChEMBL_523904 (CHEMBL1001497)
IC50 0.7±n/a nM
Citation Cherney, RJMo, RMeyer, DTVoss, MELo, YCYang, GMiller, PBScherle, PATebben, AJCarter, PHDecicco, CP Novel sulfone-containing di- and trisubstituted cyclohexanes as potent CC chemokine receptor 2 (CCR2) antagonists. Bioorg Med Chem Lett19:3418-22 (2009) 
 
C-C chemokine receptor type 2
Name:C-C chemokine receptor type 2
Type:Enzyme
Mol. Mass.:41932.32
Organism:Homo sapiens (Human)
Description:P41597
Residue:374
BDBM50268424
NameBDBM50268424
Synonyms:CHEMBL502793 | N-(2-((1S,2R,4R)-4-(diethylamino)-2-((4-(methylthio)phenylsulfonyl)methyl)cyclohexylamino)-2-oxoethyl)-3-(trifluoromethyl)benzamide
TypeSmall organic molecule
Emp. Form.C28H36F3N3O4S2
Mol. Mass.599.728
SMILESCCN(CC)[C@@H]1CC[C@H](NC(=O)CNC(=O)c2cccc(c2)C(F)(F)F)[C@H](CS(=O)(=O)c2ccc(SC)cc2)C1