Reaction Details
TargetC-C chemokine receptor type 2
LigandBDBM50233341
Substrate/Competitorn/a
Meas. Tech.ChEMBL_523905 (CHEMBL1001498)
IC50 1±n/a nM
Citation Cherney, RJMo, RMeyer, DTVoss, MELo, YCYang, GMiller, PBScherle, PATebben, AJCarter, PHDecicco, CP Novel sulfone-containing di- and trisubstituted cyclohexanes as potent CC chemokine receptor 2 (CCR2) antagonists. Bioorg Med Chem Lett19:3418-22 (2009) 
 
C-C chemokine receptor type 2
Name:C-C chemokine receptor type 2
Type:Enzyme
Mol. Mass.:41932.32
Organism:Homo sapiens (Human)
Description:P41597
Residue:374
BDBM50233341
NameBDBM50233341
Synonyms:2-(3-isopropylureido)-N-(2-((1S,2R)-2-(4-(methylthio)benzamido)cyclohexylamino)-2-oxoethyl)-5-(trifluoromethyl)benzamide | CHEMBL273083
TypeSmall organic molecule
Emp. Form.C28H34F3N5O4S
Mol. Mass.593.661
SMILESCSc1ccc(cc1)C(=O)N[C@@H]1CCCC[C@@H]1NC(=O)CNC(=O)c1cc(ccc1NC(=O)NC(C)C)C(F)(F)F