Reaction Details
TargetC-C chemokine receptor type 2
LigandBDBM50268371
Substrate/Competitorn/a
Meas. Tech.ChEMBL_523905 (CHEMBL1001498)
IC50 0.2±n/a nM
Citation Cherney, RJMo, RMeyer, DTVoss, MELo, YCYang, GMiller, PBScherle, PATebben, AJCarter, PHDecicco, CP Novel sulfone-containing di- and trisubstituted cyclohexanes as potent CC chemokine receptor 2 (CCR2) antagonists. Bioorg Med Chem Lett19:3418-22 (2009) 
 
C-C chemokine receptor type 2
Name:C-C chemokine receptor type 2
Type:Enzyme
Mol. Mass.:41932.32
Organism:Homo sapiens (Human)
Description:P41597
Residue:374
BDBM50268371
NameBDBM50268371
Synonyms:CHEMBL502247 | N-(2-((1S,2R,4R)-4-(isopropyl(methyl)amino)-2-((4-(methylthio)phenylsulfonyl)methyl)cyclohexylamino)-2-oxoethyl)-3-(trifluoromethyl)benzamide
TypeSmall organic molecule
Emp. Form.C28H36F3N3O4S2
Mol. Mass.599.728
SMILESCSc1ccc(cc1)S(=O)(=O)C[C@@H]1C[C@@H](CC[C@@H]1NC(=O)CNC(=O)c1cccc(c1)C(F)(F)F)N(C)C(C)C