Reaction Details
TargetBifunctional epoxide hydrolase 2
LigandBDBM50268381
Substrate/Competitorn/a
Meas. Tech.ChEMBL_523915 (CHEMBL1001508)
IC50 1±n/a nM
Citation Shen, HCDing, FXWang, SXu, SChen, HSTong, XTong, VMitra, KKumar, SZhang, XChen, YZhou, GPai, LYAlonso-Galicia, MChen, XZhang, BTata, JRBerger, JPColletti, SL Discovery of spirocyclic secondary amine-derived tertiary ureas as highly potent, selective and bioavailable soluble epoxide hydrolase inhibitors. Bioorg Med Chem Lett19:3398-404 (2009) 
 
Bifunctional epoxide hydrolase 2
Name:Bifunctional epoxide hydrolase 2
Type:Enzyme
Mol. Mass.:62613.07
Organism:Homo sapiens (Human)
Description:P34913
Residue:555
BDBM50268381
NameBDBM50268381
Synonyms:4-oxo-N-((trans)-2-phenylcyclopropyl)-6-(pyridin-4-yl)spiro[chroman-2,4'-piperidine]-1'-carboxamide | CHEMBL495992
TypeSmall organic molecule
Emp. Form.C28H27N3O3
Mol. Mass.453.5323
SMILESO=C(N[C@H]1C[C@@H]1c1ccccc1)N1CCC2(CC1)CC(=O)c1cc(ccc1O2)-c1ccncc1