Reaction Details
TargetBifunctional epoxide hydrolase 2
LigandBDBM50268321
Substrate/Competitorn/a
Meas. Tech.ChEMBL_523915 (CHEMBL1001508)
IC50<1±n/a nM
Citation Shen, HCDing, FXWang, SXu, SChen, HSTong, XTong, VMitra, KKumar, SZhang, XChen, YZhou, GPai, LYAlonso-Galicia, MChen, XZhang, BTata, JRBerger, JPColletti, SL Discovery of spirocyclic secondary amine-derived tertiary ureas as highly potent, selective and bioavailable soluble epoxide hydrolase inhibitors. Bioorg Med Chem Lett19:3398-404 (2009) 
 
Bifunctional epoxide hydrolase 2
Name:Bifunctional epoxide hydrolase 2
Type:Enzyme
Mol. Mass.:62613.07
Organism:Homo sapiens (Human)
Description:P34913
Residue:555
BDBM50268321
NameBDBM50268321
Synonyms:6-(methylsulfonyl)-N-((trans)-2-phenylcyclopropyl)spiro[chroman-2,4'-piperidine]-1'-carboxamide | CHEMBL519336
TypeSmall organic molecule
Emp. Form.C24H28N2O4S
Mol. Mass.440.555
SMILESCS(=O)(=O)c1ccc2OC3(CCN(CC3)C(=O)N[C@H]3C[C@@H]3c3ccccc3)CCc2c1