Reaction Details
TargetBeta-2 adrenergic receptor
LigandBDBM50268075
Substrate/Competitorn/a
Meas. Tech.ChEMBL_520026 (CHEMBL952690)
IC50 300±n/a nM
Citation Marquis, RWLago, AMCallahan, JFTrout, REGowen, MDelMar, EGVan Wagenen, BCLogan, SShimizu, SFox, JNemeth, EFYang, ZRoethke, TSmith, BRWard, KWLee, JKeenan, RMBhatnagar, P Antagonists of the calcium receptor I. Amino alcohol-based parathyroid hormone secretagogues. J Med Chem52:3982-93 (2009) 
 
Beta-2 adrenergic receptor
Name:Beta-2 adrenergic receptor
Type:n/a
Mol. Mass.:46461.69
Organism:Homo sapiens (Human)
Description:P07550
Residue:413
BDBM50268075
NameBDBM50268075
Synonyms:(2R)-1-[(2,3-Dichlorophenyl)oxy]-3-((1,1-dimethyl-2-[4-(methyloxy)phenyl]ethyl)amino)-2-propanol | CHEMBL487507
TypeSmall organic molecule
Emp. Form.C20H25Cl2NO3
Mol. Mass.398.323
SMILESCOc1ccc(CC(C)(C)NC[C@@H](O)COc2cccc(Cl)c2Cl)cc1