Reaction Details
TargetCytochrome P450 2D6
LigandBDBM50267987
Substrate/Competitorn/a
Meas. Tech.ChEMBL_520037 (CHEMBL939876)
IC50 36±n/a nM
Citation Marquis, RWLago, AMCallahan, JFTrout, REGowen, MDelMar, EGVan Wagenen, BCLogan, SShimizu, SFox, JNemeth, EFYang, ZRoethke, TSmith, BRWard, KWLee, JKeenan, RMBhatnagar, P Antagonists of the calcium receptor I. Amino alcohol-based parathyroid hormone secretagogues. J Med Chem52:3982-93 (2009) 
 
Cytochrome P450 2D6
Name:Cytochrome P450 2D6
Type:Protein
Mol. Mass.:55774.82
Organism:Homo sapiens (Human)
Description:P10635
Residue:497
BDBM50267987
NameBDBM50267987
Synonyms:(+/-)-2-([3-((1,1-Dimethyl-2-[4-(methyloxy)phenyl]ethyl)amino)-2-hydroxypropyl]oxy)benzonitrile | CHEMBL504479
TypeSmall organic molecule
Emp. Form.C21H26N2O3
Mol. Mass.354.4427
SMILESCOc1ccc(CC(C)(C)NCC(O)COc2ccccc2C#N)cc1