Reaction Details
TargetExtracellular calcium-sensing receptor
LigandBDBM50267986
Substrate/Competitorn/a
Meas. Tech.ChEMBL_520033 (CHEMBL939872)
IC50 200±n/a nM
Citation Marquis, RWLago, AMCallahan, JFTrout, REGowen, MDelMar, EGVan Wagenen, BCLogan, SShimizu, SFox, JNemeth, EFYang, ZRoethke, TSmith, BRWard, KWLee, JKeenan, RMBhatnagar, P Antagonists of the calcium receptor I. Amino alcohol-based parathyroid hormone secretagogues. J Med Chem52:3982-93 (2009) 
 
Extracellular calcium-sensing receptor
Name:Extracellular calcium-sensing receptor
Type:Protein
Mol. Mass.:120663.13
Organism:Homo sapiens (Human)
Description:P41180
Residue:1078
BDBM50267986
NameBDBM50267986
Synonyms:(+/-)-1-[(2,3-Dichlorophenyl)oxy]-3-((1,1-dimethyl-2-[4-(methyloxy)-phenyl]ethyl)amino)-2-propanol | CHEMBL491251
TypeSmall organic molecule
Emp. Form.C20H25Cl2NO3
Mol. Mass.398.323
SMILESCOc1ccc(CC(C)(C)NCC(O)COc2cccc(Cl)c2Cl)cc1