Reaction Details
TargetSodium-dependent noradrenaline transporter
LigandBDBM50267987
Substrate/Competitorn/a
Meas. Tech.ChEMBL_520036 (CHEMBL939875)
IC50 300±n/a nM
Citation Marquis, RWLago, AMCallahan, JFTrout, REGowen, MDelMar, EGVan Wagenen, BCLogan, SShimizu, SFox, JNemeth, EFYang, ZRoethke, TSmith, BRWard, KWLee, JKeenan, RMBhatnagar, P Antagonists of the calcium receptor I. Amino alcohol-based parathyroid hormone secretagogues. J Med Chem52:3982-93 (2009) 
 
Sodium-dependent noradrenaline transporter
Name:Sodium-dependent noradrenaline transporter
Type:Multi-pass membrane protein
Mol. Mass.:69337.72
Organism:Homo sapiens (Human)
Description:P23975
Residue:617
BDBM50267987
NameBDBM50267987
Synonyms:(+/-)-2-([3-((1,1-Dimethyl-2-[4-(methyloxy)phenyl]ethyl)amino)-2-hydroxypropyl]oxy)benzonitrile | CHEMBL504479
TypeSmall organic molecule
Emp. Form.C21H26N2O3
Mol. Mass.354.4427
SMILESCOc1ccc(CC(C)(C)NCC(O)COc2ccccc2C#N)cc1