Reaction Details
TargetSodium-dependent dopamine transporter
LigandBDBM50267988
Substrate/Competitorn/a
Meas. Tech.ChEMBL_520034 (CHEMBL939873)
IC50 1100±n/a nM
Citation Marquis, RWLago, AMCallahan, JFTrout, REGowen, MDelMar, EGVan Wagenen, BCLogan, SShimizu, SFox, JNemeth, EFYang, ZRoethke, TSmith, BRWard, KWLee, JKeenan, RMBhatnagar, P Antagonists of the calcium receptor I. Amino alcohol-based parathyroid hormone secretagogues. J Med Chem52:3982-93 (2009) 
 
Sodium-dependent dopamine transporter
Name:Sodium-dependent dopamine transporter
Type:Multi-pass membrane protein
Mol. Mass.:68497.11
Organism:Homo sapiens (Human)
Description:Q01959
Residue:620
BDBM50267988
NameBDBM50267988
Synonyms:(+/-)-2-Chloro-6-([3-((1,1-dimethyl-2-[4-(methyloxy)phenyl]ethyl)-amino)-2-hydroxypropyl]oxy)benzonitrile | CHEMBL523475
TypeSmall organic molecule
Emp. Form.C21H25ClN2O3
Mol. Mass.388.888
SMILESCOc1ccc(CC(C)(C)NCC(O)COc2cccc(Cl)c2C#N)cc1