Reaction Details
TargetExtracellular calcium-sensing receptor
LigandBDBM50268077
Substrate/Competitorn/a
Meas. Tech.ChEMBL_520033 (CHEMBL939872)
IC50 31800±n/a nM
Citation Marquis, RWLago, AMCallahan, JFTrout, REGowen, MDelMar, EGVan Wagenen, BCLogan, SShimizu, SFox, JNemeth, EFYang, ZRoethke, TSmith, BRWard, KWLee, JKeenan, RMBhatnagar, P Antagonists of the calcium receptor I. Amino alcohol-based parathyroid hormone secretagogues. J Med Chem52:3982-93 (2009) 
 
Extracellular calcium-sensing receptor
Name:Extracellular calcium-sensing receptor
Type:Protein
Mol. Mass.:120663.13
Organism:Homo sapiens (Human)
Description:P41180
Residue:1078
BDBM50268077
NameBDBM50268077
Synonyms:(S)-4-(2-hydroxy-3-(1-(4-methoxyphenyl)-2-methylpropan-2-ylamino)propoxy)-1H-benzo[d]imidazol-2(3H)-one | CHEMBL486278
TypeSmall organic molecule
Emp. Form.C21H27N3O4
Mol. Mass.385.4568
SMILESCOc1ccc(CC(C)(C)NC[C@H](O)COc2cccc3[nH]c(=O)[nH]c23)cc1