Reaction Details
TargetExtracellular calcium-sensing receptor
LigandBDBM50268028
Substrate/Competitorn/a
Meas. Tech.ChEMBL_520033 (CHEMBL939872)
IC50>10000±n/a nM
Citation Marquis, RWLago, AMCallahan, JFTrout, REGowen, MDelMar, EGVan Wagenen, BCLogan, SShimizu, SFox, JNemeth, EFYang, ZRoethke, TSmith, BRWard, KWLee, JKeenan, RMBhatnagar, P Antagonists of the calcium receptor I. Amino alcohol-based parathyroid hormone secretagogues. J Med Chem52:3982-93 (2009) 
 
Extracellular calcium-sensing receptor
Name:Extracellular calcium-sensing receptor
Type:Protein
Mol. Mass.:120663.13
Organism:Homo sapiens (Human)
Description:P41180
Residue:1078
BDBM50268028
NameBDBM50268028
Synonyms:(+/-)-1-((2-[4-(Methyloxy)phenyl]ethyl)amino)-3-(phenyloxy)-2-propanol | CHEMBL482875
TypeSmall organic molecule
Emp. Form.C18H23NO3
Mol. Mass.301.3801
SMILESCOc1ccc(CCNCC(O)COc2ccccc2)cc1