Reaction Details
TargetBeta-3 adrenergic receptor
LigandBDBM50268076
Substrate/Competitorn/a
Meas. Tech.ChEMBL_520025 (CHEMBL952689)
EC50 200±n/a nM
Citation Marquis, RWLago, AMCallahan, JFTrout, REGowen, MDelMar, EGVan Wagenen, BCLogan, SShimizu, SFox, JNemeth, EFYang, ZRoethke, TSmith, BRWard, KWLee, JKeenan, RMBhatnagar, P Antagonists of the calcium receptor I. Amino alcohol-based parathyroid hormone secretagogues. J Med Chem52:3982-93 (2009) 
 
Beta-3 adrenergic receptor
Name:Beta-3 adrenergic receptor
Type:G Protein-Coupled Receptor (GPCR)
Mol. Mass.:43534.88
Organism:Homo sapiens (Human)
Description:n/a
Residue:408
BDBM50268076
NameBDBM50268076
Synonyms:(2S)-1-[(2,3-Dichlorophenyl)oxy]-3-((1,1-dimethyl-2-[4-(methyloxy)phenyl]ethyl)amino)-2-propanol | CHEMBL487508
TypeSmall organic molecule
Emp. Form.C20H25Cl2NO3
Mol. Mass.398.323
SMILESCOc1ccc(CC(C)(C)NC[C@H](O)COc2cccc(Cl)c2Cl)cc1