Reaction Details
TargetExtracellular calcium-sensing receptor
LigandBDBM50161093
Substrate/Competitorn/a
Meas. Tech.ChEMBL_520033 (CHEMBL939872)
IC50 3±n/a nM
Citation Marquis, RWLago, AMCallahan, JFTrout, REGowen, MDelMar, EGVan Wagenen, BCLogan, SShimizu, SFox, JNemeth, EFYang, ZRoethke, TSmith, BRWard, KWLee, JKeenan, RMBhatnagar, P Antagonists of the calcium receptor I. Amino alcohol-based parathyroid hormone secretagogues. J Med Chem52:3982-93 (2009) 
 
Extracellular calcium-sensing receptor
Name:Extracellular calcium-sensing receptor
Type:Protein
Mol. Mass.:120663.13
Organism:Homo sapiens (Human)
Description:P41180
Residue:1078
BDBM50161093
NameBDBM50161093
Synonyms:(R)-2-chloro-6-(2-hydroxy-3-(2-methyl-1-(naphthalen-2-yl)propan-2-ylamino)propoxy)benzonitrile 2-Chloro-6-[(R)-3-(1,1-dimethyl-2-naphthalen-2-yl-ethylamino)-2-hydroxy-propoxy]-benzonitrile CHEMBL2112075
TypeSmall organic molecule
Emp. Form.C24H25ClN2O2
Mol. Mass.408.921
SMILESCC(C)(Cc1ccc2ccccc2c1)NC[C@@H](O)COc1cccc(Cl)c1C#N