Reaction Details
TargetCannabinoid receptor 1
LigandBDBM50279086
Substrate/Competitorn/a
Meas. Tech.ChEMBL_545295 (CHEMBL1020741)
IC50 12.9±n/a nM
Citation Wu, CHHung, MSSong, JSYeh, TKChou, MCChu, CMJan, JJHsieh, MTTseng, SLChang, CPHsieh, WPLin, YYeh, YNChung, WLKuo, CWLin, CYShy, HSChao, YSShia, KS Discovery of 2-[5-(4-chloro-phenyl)-1-(2,4-dichloro-phenyl)-4-ethyl-1H-pyrazol-3-yl]-1,5,5-trimethyl-1,5-dihydro-imidazol-4-thione (BPR-890) via an active metabolite. A novel, potent and selective cannabinoid-1 receptor inverse agonist with high antiobesity efficacy in DIO mice. J Med Chem52:4496-510 (2009) 
 
Cannabinoid receptor 1
Name:Cannabinoid receptor 1
Type:G Protein-Coupled Receptor (GPCR)
Mol. Mass.:52868.96
Organism:Homo sapiens (Human)
Description:P21554
Residue:472
BDBM50279086
NameBDBM50279086
Synonyms:2-[5-(4-Chloro-phenyl)-1-(2,4-dichloro-phenyl)-4-ethyl-1Hpyrazol-3-yl]-1,5,5-trimethyl-1,5-dihydro-imidazol-4-one | CHEMBL500689
TypeSmall organic molecule
Emp. Form.C23H21Cl3N4O
Mol. Mass.475.798
SMILESCCc1c(nn(c1-c1ccc(Cl)cc1)-c1ccc(Cl)cc1Cl)C1=NC(=O)C(C)(C)N1C