Reaction Details
TargetCannabinoid receptor 1
LigandBDBM50279125
Substrate/Competitorn/a
Meas. Tech.ChEMBL_545298 (CHEMBL1020744)
EC50 81±n/a nM
Citation Wu, CHHung, MSSong, JSYeh, TKChou, MCChu, CMJan, JJHsieh, MTTseng, SLChang, CPHsieh, WPLin, YYeh, YNChung, WLKuo, CWLin, CYShy, HSChao, YSShia, KS Discovery of 2-[5-(4-chloro-phenyl)-1-(2,4-dichloro-phenyl)-4-ethyl-1H-pyrazol-3-yl]-1,5,5-trimethyl-1,5-dihydro-imidazol-4-thione (BPR-890) via an active metabolite. A novel, potent and selective cannabinoid-1 receptor inverse agonist with high antiobesity efficacy in DIO mice. J Med Chem52:4496-510 (2009) 
 
Cannabinoid receptor 1
Name:Cannabinoid receptor 1
Type:G Protein-Coupled Receptor (GPCR)
Mol. Mass.:52868.96
Organism:Homo sapiens (Human)
Description:P21554
Residue:472
BDBM50279125
NameBDBM50279125
Synonyms:2-[1-(2,4-Dichloro-phenyl)-4-methyl-5-(4-trifluoromethylphenyl)-1H-pyrazol-3-yl]-1,5,5-trimethyl-1,5-dihydro-imidazol-4-one | CHEMBL497879
TypeSmall organic molecule
Emp. Form.C23H19Cl2F3N4O
Mol. Mass.495.324
SMILESCN1C(=NC(=O)C1(C)C)c1nn(c(c1C)-c1ccc(cc1)C(F)(F)F)-c1ccc(Cl)cc1Cl