Reaction Details
TargetCannabinoid receptor 2
LigandBDBM50279202
Substrate/Competitorn/a
Meas. Tech.ChEMBL_545296 (CHEMBL1020742)
IC50 10260±n/a nM
Citation Wu, CHHung, MSSong, JSYeh, TKChou, MCChu, CMJan, JJHsieh, MTTseng, SLChang, CPHsieh, WPLin, YYeh, YNChung, WLKuo, CWLin, CYShy, HSChao, YSShia, KS Discovery of 2-[5-(4-chloro-phenyl)-1-(2,4-dichloro-phenyl)-4-ethyl-1H-pyrazol-3-yl]-1,5,5-trimethyl-1,5-dihydro-imidazol-4-thione (BPR-890) via an active metabolite. A novel, potent and selective cannabinoid-1 receptor inverse agonist with high antiobesity efficacy in DIO mice. J Med Chem52:4496-510 (2009) 
 
Cannabinoid receptor 2
Name:Cannabinoid receptor 2
Type:G Protein-Coupled Receptor (GPCR)
Mol. Mass.:39690.94
Organism:Homo sapiens (Human)
Description:P34972
Residue:360
BDBM50279202
NameBDBM50279202
Synonyms:2-[5-(4-Chloro-phenyl)-1-(2,4-dichloro-phenyl)-4-ethyl-1H-pyrazol-3-yl]-5,5-dimethyl-3,5-dihydro-imidazol-4-one | CHEMBL524277
TypeSmall organic molecule
Emp. Form.C22H19Cl3N4O
Mol. Mass.461.771
SMILESCCc1c(nn(c1-c1ccc(Cl)cc1)-c1ccc(Cl)cc1Cl)C1=NC(C)(C)C(=O)N1