Reaction Details
TargetNeuronal acetylcholine receptor subunit alpha-4
LigandBDBM50279206
Substrate/Competitorn/a
Meas. Tech.ChEMBL_546017 (CHEMBL1028495)
Ki 78±n/a nM
Citation Tasso, BCanu Boido, CTerranova, EGotti, CRiganti, LClementi, FArtali, RBombieri, GMeneghetti, FSparatore, F Synthesis, binding, and modeling studies of new cytisine derivatives, as ligands for neuronal nicotinic acetylcholine receptor subtypes. J Med Chem52:4345-57 (2009) 
 
Neuronal acetylcholine receptor subunit alpha-4
Name:Neuronal acetylcholine receptor subunit alpha-4
Type:Enzyme
Mol. Mass.:70196.44
Organism:Rattus norvegicus (Rat)
Description:P09483
Residue:630
BDBM50279206
NameBDBM50279206
Synonyms:(1R,5S)-3-Phenethyl-1,2,3,4,5,6-hexahydro-1,5-methano-pyrido[1,2-a][1,5]diazocin-8-one | CHEMBL497946
TypeSmall organic molecule
Emp. Form.C19H22N2O
Mol. Mass.294.3908
SMILESO=c1cccc2[C@@H]3C[C@@H](CN(CCc4ccccc4)C3)Cn12