Reaction Details
TargetNeuronal acetylcholine receptor subunit alpha-4
LigandBDBM50240956
Substrate/Competitorn/a
Meas. Tech.ChEMBL_546017 (CHEMBL1028495)
Ki 3.2±n/a nM
Citation Tasso, BCanu Boido, CTerranova, EGotti, CRiganti, LClementi, FArtali, RBombieri, GMeneghetti, FSparatore, F Synthesis, binding, and modeling studies of new cytisine derivatives, as ligands for neuronal nicotinic acetylcholine receptor subtypes. J Med Chem52:4345-57 (2009) 
 
Neuronal acetylcholine receptor subunit alpha-4
Name:Neuronal acetylcholine receptor subunit alpha-4
Type:Enzyme
Mol. Mass.:70196.44
Organism:Rattus norvegicus (Rat)
Description:P09483
Residue:630
BDBM50240956
NameBDBM50240956
Synonyms:(1R,5S)-3-(3-Oxo-butyl)-1,2,3,4,5,6-hexahydro-1,5-methano-pyrido[1,2-a][1,5]diazocin-8-one | CHEMBL190851
TypeSmall organic molecule
Emp. Form.C15H20N2O2
Mol. Mass.260.3315
SMILESCC(=O)CCN1C[C@@H]2C[C@H](C1)c1cccc(=O)n1C2