Reaction Details
TargetNeuronal acetylcholine receptor subunit alpha-4
LigandBDBM50279333
Substrate/Competitorn/a
Meas. Tech.ChEMBL_546015 (CHEMBL1028493)
Ki 35±n/a nM
Citation Tasso, BCanu Boido, CTerranova, EGotti, CRiganti, LClementi, FArtali, RBombieri, GMeneghetti, FSparatore, F Synthesis, binding, and modeling studies of new cytisine derivatives, as ligands for neuronal nicotinic acetylcholine receptor subtypes. J Med Chem52:4345-57 (2009) 
 
Neuronal acetylcholine receptor subunit alpha-4
Name:Neuronal acetylcholine receptor subunit alpha-4
Type:Enzyme
Mol. Mass.:70196.44
Organism:Rattus norvegicus (Rat)
Description:P09483
Residue:630
BDBM50279333
NameBDBM50279333
Synonyms:3-(Cytisin-12-yl)propionamide | CHEMBL483804
TypeSmall organic molecule
Emp. Form.C14H19N3O2
Mol. Mass.261.3196
SMILESNC(=O)CCN1C[C@@H]2C[C@H](C1)c1cccc(=O)n1C2