Reaction Details
TargetNeuronal acetylcholine receptor subunit alpha-4
LigandBDBM50279176
Substrate/Competitorn/a
Meas. Tech.ChEMBL_546015 (CHEMBL1028493)
Ki 330±n/a nM
Citation Tasso, BCanu Boido, CTerranova, EGotti, CRiganti, LClementi, FArtali, RBombieri, GMeneghetti, FSparatore, F Synthesis, binding, and modeling studies of new cytisine derivatives, as ligands for neuronal nicotinic acetylcholine receptor subtypes. J Med Chem52:4345-57 (2009) 
 
Neuronal acetylcholine receptor subunit alpha-4
Name:Neuronal acetylcholine receptor subunit alpha-4
Type:Enzyme
Mol. Mass.:70196.44
Organism:Rattus norvegicus (Rat)
Description:P09483
Residue:630
BDBM50279176
NameBDBM50279176
Synonyms:(1R,5S)-3-(4-Fluoro-benzyl)-1,2,3,4,5,6-hexahydro-1,5-methano-pyrido[1,2-a][1,5]diazocin-8-one | CHEMBL524813
TypeSmall organic molecule
Emp. Form.C18H19FN2O
Mol. Mass.298.3547
SMILESFc1ccc(CN2C[C@@H]3C[C@H](C2)c2cccc(=O)n2C3)cc1