Reaction Details
Target3-oxo-5-alpha-steroid 4-dehydrogenase 2
LigandBDBM50057448
Substrate/Competitorn/a
Meas. Tech.ChEBML_204583
Ki 7±n/a nM
Citation Holt, DALevy, MAYen, HKOh, HJMetcalf, BWWier, PJ Inhibition of steroid 5α-reductase by 3-nitrosteroids: synthesis, mechanism of inhibition, and in vivo activity. Bioorg Med Chem Lett1:27-32 (1991)    Article
 
3-oxo-5-alpha-steroid 4-dehydrogenase 2
Name:3-oxo-5-alpha-steroid 4-dehydrogenase 2
Type:Enzyme
Mol. Mass.:28406.59
Organism:Homo sapiens (Human)
Description:P31213
Residue:254
BDBM50057448
NameBDBM50057448
Synonyms:(10R,13S,17S)-17-Diisopropylcarbamoyl-10,13-dimethyl-2,7,8,9,10,11,12,13,14,15,16,17-dodecahydro-1H-cyclopenta[a]phenanthrene-3-carboxylic acid CHEMBL278283
TypeSmall organic molecule
Emp. Form.C27H41NO3
Mol. Mass.427.6193
SMILESCC(C)N(C(C)C)C(=O)[C@H]1CCC2C3CC=C4C=C(CC[C@]4(C)C3CC[C@]12C)C(O)=O