Reaction Details
TargetCarboxypeptidase A1
LigandBDBM50279945
Substrate/Competitorn/a
Meas. Tech.ChEBML_45616
Ki 250±n/a nM
Citation Kim, DHShin, YSKim, KB The structural feature of S1′ subsite of carboxypeptidase A Bioorg Med Chem Lett1:317-322 (1991)    Article
 
Carboxypeptidase A1
Name:Carboxypeptidase A1
Type:Enzyme
Mol. Mass.:47073.90
Organism:Bos taurus (bovine)
Description:From Sigma-Aldrich Co.
Residue:419
BDBM50279945
NameBDBM50279945
Synonyms:3-(3,4-Difluoro-phenyl)-2-mercaptomethyl-propionic acid | CHEMBL108812
TypeSmall organic molecule
Emp. Form.C10H10F2O2S
Mol. Mass.232.247
SMILESOC(=O)C(CS)Cc1ccc(F)c(F)c1