Reaction Details
TargetCarboxypeptidase A1
LigandBDBM50279946
Substrate/Competitorn/a
Meas. Tech.ChEBML_45616
Ki 590±n/a nM
Citation Kim, DHShin, YSKim, KB The structural feature of S1′ subsite of carboxypeptidase A Bioorg Med Chem Lett1:317-322 (1991)    Article
 
Carboxypeptidase A1
Name:Carboxypeptidase A1
Type:Enzyme
Mol. Mass.:47073.90
Organism:Bos taurus (bovine)
Description:From Sigma-Aldrich Co.
Residue:419
BDBM50279946
NameBDBM50279946
Synonyms:2-Mercaptomethyl-3-(3,4,5-trifluoro-phenyl)-propionic acid | CHEMBL108486
TypeSmall organic molecule
Emp. Form.C10H9F3O2S
Mol. Mass.250.237
SMILESOC(=O)C(CS)Cc1cc(F)c(F)c(F)c1