Reaction Details
TargetCarboxypeptidase A1
LigandBDBM50279947
Substrate/Competitorn/a
Meas. Tech.ChEBML_45616
Ki 37±n/a nM
Citation Kim, DHShin, YSKim, KB The structural feature of S1′ subsite of carboxypeptidase A Bioorg Med Chem Lett1:317-322 (1991)    Article
 
Carboxypeptidase A1
Name:Carboxypeptidase A1
Type:Enzyme
Mol. Mass.:47073.90
Organism:Bos taurus (bovine)
Description:From Sigma-Aldrich Co.
Residue:419
BDBM50279947
NameBDBM50279947
Synonyms:3-(4-Fluoro-phenyl)-2-mercaptomethyl-propionic acid | CHEMBL109520
TypeSmall organic molecule
Emp. Form.C10H11FO2S
Mol. Mass.214.257
SMILESOC(=O)C(CS)Cc1ccc(F)cc1