Reaction Details
TargetCarboxypeptidase A1
LigandBDBM50279952
Substrate/Competitorn/a
Meas. Tech.ChEBML_45616
Ki 492±n/a nM
Citation Kim, DHShin, YSKim, KB The structural feature of S1′ subsite of carboxypeptidase A Bioorg Med Chem Lett1:317-322 (1991)    Article
 
Carboxypeptidase A1
Name:Carboxypeptidase A1
Type:Enzyme
Mol. Mass.:47073.90
Organism:Bos taurus (bovine)
Description:From Sigma-Aldrich Co.
Residue:419
BDBM50279952
NameBDBM50279952
Synonyms:3-(3,4-Dimethyl-phenyl)-2-mercaptomethyl-propionic acid | CHEMBL108489
TypeSmall organic molecule
Emp. Form.C12H16O2S
Mol. Mass.224.319
SMILESCc1ccc(CC(CS)C(O)=O)cc1C