Reaction Details
TargetCarboxypeptidase A1
LigandBDBM50279953
Substrate/Competitorn/a
Meas. Tech.ChEBML_45616
Ki 170±n/a nM
Citation Kim, DHShin, YSKim, KB The structural feature of S1′ subsite of carboxypeptidase A Bioorg Med Chem Lett1:317-322 (1991)    Article
 
Carboxypeptidase A1
Name:Carboxypeptidase A1
Type:Enzyme
Mol. Mass.:47073.90
Organism:Bos taurus (bovine)
Description:From Sigma-Aldrich Co.
Residue:419
BDBM50279953
NameBDBM50279953
Synonyms:2-Mercaptomethyl-3-m-tolyl-propionic acid | CHEMBL322812
TypeSmall organic molecule
Emp. Form.C11H14O2S
Mol. Mass.210.293
SMILESCc1cccc(CC(CS)C(O)=O)c1