Reaction Details
TargetCarboxypeptidase A1
LigandBDBM50279961
Substrate/Competitorn/a
Meas. Tech.ChEBML_45615
Ki 150±n/a nM
Citation Kim, DHKim, KB The function of S1′ subsite pocket of carboxypeptidase A Bioorg Med Chem Lett1:323-326 (1991)    Article
 
Carboxypeptidase A1
Name:Carboxypeptidase A1
Type:Enzyme
Mol. Mass.:47073.90
Organism:Bos taurus (bovine)
Description:From Sigma-Aldrich Co.
Residue:419
BDBM50279961
NameBDBM50279961
Synonyms:3-(4-Bromo-phenyl)-2-mercaptomethyl-propionic acid | CHEMBL110988
TypeSmall organic molecule
Emp. Form.C10H11BrO2S
Mol. Mass.275.162
SMILESOC(=O)C(CS)Cc1ccc(Br)cc1