Reaction Details
TargetCarboxypeptidase A1
LigandBDBM50279955
Substrate/Competitorn/a
Meas. Tech.ChEBML_45615
Ki 112±n/a nM
Citation Kim, DHKim, KB The function of S1′ subsite pocket of carboxypeptidase A Bioorg Med Chem Lett1:323-326 (1991)    Article
 
Carboxypeptidase A1
Name:Carboxypeptidase A1
Type:Enzyme
Mol. Mass.:47073.90
Organism:Bos taurus (bovine)
Description:From Sigma-Aldrich Co.
Residue:419
BDBM50279955
NameBDBM50279955
Synonyms:2-Mercaptomethyl-3-p-tolyl-propionic acid | CHEMBL111288
TypeSmall organic molecule
Emp. Form.C11H14O2S
Mol. Mass.210.293
SMILESCc1ccc(CC(CS)C(O)=O)cc1