Reaction Details
TargetHistamine H3 receptor
LigandBDBM22911
Substrate/Competitorn/a
Meas. Tech.ChEBML_85832
IC50 4.6±n/a nM
Citation Howson, WParsons, MERaval, PSwayne, GT Two novel, potent and selective histamine H3 receptor agonists Bioorg Med Chem Lett2:77-78 (1992)    Article
 
Histamine H3 receptor
Name:Histamine H3 receptor
Type:Enzyme Catalytic Domain
Mol. Mass.:48753.61
Organism:GUINEA PIG
Description:HISTAMINE H3 HRH3 GUINEA PIG::Q9JI35
Residue:445
BDBM22911
NameBDBM22911
Synonyms:2-(3H-imidazol-4-yl)ethylsulfanylmethanimidamide CHEMBL544911 {[2-(1H-imidazol-4-yl)ethyl]sulfanyl}methanimidamide
TypeSmall organic molecule
Emp. Form.C6H10N4S
Mol. Mass.170.235
SMILESNC(=N)SCCc1cnc[nH]1