Reaction Details
TargetNeutrophil elastase
LigandBDBM50280125
Substrate/Competitorn/a
Meas. Tech.ChEBML_63968
Ki 44±n/a nM
Citation Angelastro, MRBey, PMehdi, SPeet, NP Synthesis of a peptidyl 2,2-difluoro-3-aminopropionate Bioorg Med Chem Lett2:1235-1238 (1992)    Article
 
Neutrophil elastase
Name:Neutrophil elastase
Type:Enzyme
Mol. Mass.:28532.38
Organism:Homo sapiens (Human)
Description:P08246
Residue:267
BDBM50280125
NameBDBM50280125
Synonyms:(1-{1-Methyl-2-oxo-2-[2-(3,3,3-trifluoro-1-isopropyl-2-oxo-propylcarbamoyl)-pyrrolidin-1-yl]-ethylcarbamoyl}-ethylamino)-acetic acid tert-butyl ester | CHEMBL2371207
TypeSmall organic molecule
Emp. Form.C23H37F3N4O6
Mol. Mass.522.5583
SMILESCC(C)[C@H](NC(=O)[C@@H]1CCCN1C(=O)[C@H](C)NC(=O)[C@H](C)NCC(=O)OC(C)(C)C)C(=O)C(F)(F)F