Reaction Details
TargetNeutrophil elastase
LigandBDBM50014732
Substrate/Competitorn/a
Meas. Tech.ChEBML_63968
Ki 10±n/a nM
Citation Angelastro, MRBey, PMehdi, SPeet, NP Synthesis of a peptidyl 2,2-difluoro-3-aminopropionate Bioorg Med Chem Lett2:1235-1238 (1992)    Article
 
Neutrophil elastase
Name:Neutrophil elastase
Type:Enzyme
Mol. Mass.:28532.38
Organism:Homo sapiens (Human)
Description:P08246
Residue:267
BDBM50014732
NameBDBM50014732
Synonyms:1-{2-[2-(5-Dimethylamino-naphthalene-1-sulfonylamino)-propionylamino]-propionyl}-pyrrolidine-2-carboxylic acid (3,3,3-trifluoro-1-isopropyl-2-oxo-propyl)-amide | CHEMBL339870
TypeSmall organic molecule
Emp. Form.C29H38F3N5O6S
Mol. Mass.641.702
SMILESCC(C)[C@H](NC(=O)[C@@H]1CCCN1C(=O)[C@H](C)NC(=O)[C@H](C)NS(=O)(=O)c1cccc2c(cccc12)N(C)C)C(=O)C(F)(F)F