Reaction Details
TargetNeutrophil elastase
LigandBDBM50014730
Substrate/Competitorn/a
Meas. Tech.ChEBML_63968
Ki 14±n/a nM
Citation Angelastro, MRBey, PMehdi, SPeet, NP Synthesis of a peptidyl 2,2-difluoro-3-aminopropionate Bioorg Med Chem Lett2:1235-1238 (1992)    Article
 
Neutrophil elastase
Name:Neutrophil elastase
Type:Enzyme
Mol. Mass.:28532.38
Organism:Homo sapiens (Human)
Description:P08246
Residue:267
BDBM50014730
NameBDBM50014730
Synonyms:CHEMBL130271 | N-(1-{1-Methyl-2-oxo-2-[2-(3,3,3-trifluoro-1-isopropyl-2-oxo-propylcarbamoyl)-pyrrolidin-1-yl]-ethylcarbamoyl}-ethyl)-succinamic acid methyl ester
TypeSmall organic molecule
Emp. Form.C22H33F3N4O7
Mol. Mass.522.5152
SMILESCOC(=O)CCC(=O)N[C@@H](C)C(=O)N[C@@H](C)C(=O)N1CCC[C@H]1C(=O)N[C@@H](C(C)C)C(=O)C(F)(F)F