Reaction Details
TargetKappa-type opioid receptor
LigandBDBM50280147
Substrate/Competitorn/a
Meas. Tech.ChEBML_220929
IC50 0.220000±n/a nM
Citation Birch, PJHayes, AGJohnson, MRLea, TAMurray, PJRogers, HScopes, DI Preparation and evaluation of some hydrophilic phenylacetyl-piperazines as peripherally selective κ-opioid receptor agonists Bioorg Med Chem Lett2:1275-1278 (1992)    Article
 
Kappa-type opioid receptor
Name:Kappa-type opioid receptor
Type:G Protein-Coupled Receptor (GPCR)
Mol. Mass.:42648.76
Organism:Homo sapiens (Human)
Description:P41145
Residue:380
BDBM50280147
NameBDBM50280147
Synonyms:1-[4-Acetyl-2-((S)-3-hydroxy-pyrrolidin-1-ylmethyl)-piperazin-1-yl]-2-(3,4-dichloro-phenyl)-ethanone | CHEMBL423653
TypeSmall organic molecule
Emp. Form.C19H25Cl2N3O3
Mol. Mass.414.326
SMILESCC(=O)N1CCN(C(CN2CC[C@H](O)C2)C1)C(=O)Cc1ccc(Cl)c(Cl)c1