Reaction Details
TargetKappa-type opioid receptor
LigandBDBM50280148
Substrate/Competitorn/a
Meas. Tech.ChEBML_220929
IC50 4.6±n/a nM
Citation Birch, PJHayes, AGJohnson, MRLea, TAMurray, PJRogers, HScopes, DI Preparation and evaluation of some hydrophilic phenylacetyl-piperazines as peripherally selective κ-opioid receptor agonists Bioorg Med Chem Lett2:1275-1278 (1992)    Article
 
Kappa-type opioid receptor
Name:Kappa-type opioid receptor
Type:G Protein-Coupled Receptor (GPCR)
Mol. Mass.:42648.76
Organism:Homo sapiens (Human)
Description:P41145
Residue:380
BDBM50280148
NameBDBM50280148
Synonyms:1-[4-Acetyl-2-((S)-3-hydroxy-pyrrolidin-1-ylmethyl)-piperazin-1-yl]-2-(3,5-difluoro-phenyl)-ethanone | CHEMBL22544
TypeSmall organic molecule
Emp. Form.C19H25F2N3O3
Mol. Mass.381.4169
SMILESCC(=O)N1CCN(C(CN2CC[C@H](O)C2)C1)C(=O)Cc1cc(F)cc(F)c1