Reaction Details
TargetProthrombin
LigandBDBM50280255
Substrate/Competitorn/a
Meas. Tech.ChEMBL_208535 (CHEMBL813629)
Ki 1.7±n/a nM
Citation Iwanowicz, EJLin, JRoberts, DGMichel, IMSeiler, SM α-hydroxy- and α-ketoester functionalized thrombin inhibitors Bioorg Med Chem Lett2:1607-1612 (1992)    Article
 
Prothrombin
Name:Prothrombin
Type:Protein
Mol. Mass.:70029.57
Organism:Homo sapiens (Human)
Description:P00734
Residue:622
BDBM50280255
NameBDBM50280255
Synonyms:7-Amino-3-{[(S)-1-((R)-2-amino-3-phenyl-propionyl)-pyrrolidine-2-carbonyl]-amino}-2-hydroxy-2-methoxy-heptanoic acid methyl ester; dihydrochloride CHEMBL539241
TypeSmall organic molecule
Emp. Form.C23H36N4O6
Mol. Mass.464.5551
SMILESCOC(=O)C(O)(OC)C(CCCCN)NC(=O)[C@@H]1CCCN1C(=O)[C@H](N)Cc1ccccc1