Reaction Details
TargetLeukotriene B4 receptor 1
LigandBDBM50280289
Substrate/Competitorn/a
Meas. Tech.ChEMBL_99492 (CHEMBL704380)
Ki 110±n/a nM
Citation Sofia, MJJackson, WTSaussyJr., DLSilbaugh, SAFroelich, LLCockerham, SLStengel, PW Ortho-alkoxyphenol leukotriene B4 receptor antagonists Bioorg Med Chem Lett2:1669-1674 (1992)    Article
 
Leukotriene B4 receptor 1
Name:Leukotriene B4 receptor 1
Type:Enzyme Catalytic Domain
Mol. Mass.:37582.68
Organism:Homo sapiens (Human)
Description:Q15722
Residue:352
BDBM50280289
NameBDBM50280289
Synonyms:4-ethyl-2-(4-fluorobenzyloxy)-5-[6-methyl-6-(2H-1,2,3,4-tetraazol-5-yl)heptyloxy]phenol; with sodium ion | CHEMBL47725
TypeSmall organic molecule
Emp. Form.C24H30FN4O3
Mol. Mass.441.519
SMILESCCc1cc(OCc2ccc(F)cc2)c(O)cc1OCCCCCC(C)(C)c1nn[n-]n1