Reaction Details
TargetLeukotriene B4 receptor 1
LigandBDBM50280290
Substrate/Competitorn/a
Meas. Tech.ChEBML_99654
Ki 25±n/a nM
Citation Sofia, MJSaussyJr., DLJackson, WTMarder, PSilbaugh, SAFroelich, LLCockerham, SLStengel, PW Ortho-alkoxyphenol leukotriene B4 receptor antagonists: effect of a chroman carboxylic acid. Bioorg Med Chem Lett2:1675-1680 (1992)    Article
 
Leukotriene B4 receptor 1
Name:Leukotriene B4 receptor 1
Type:Enzyme Catalytic Domain
Mol. Mass.:37582.68
Organism:Homo sapiens (Human)
Description:Q15722
Residue:352
BDBM50280290
NameBDBM50280290
Synonyms:4-ethyl-2-methoxy-5-[6-methyl-6-(2H-1,2,3,4-tetraazol-5-yl)heptyloxy]phenol; with sodium ion sodium 4-ethyl-2-methoxy-5-[6-methyl-6-(2H-1,2,3,4-tetraazol-5-yl)heptyloxy]phenol
TypeSmall organic molecule
Emp. Form.C18H27N4O3
Mol. Mass.347.4325
SMILESCCc1cc(OC)c(O)cc1OCCCCCC(C)(C)c1nn[n-]n1