Reaction Details
TargetLeukotriene B4 receptor 1/2
LigandBDBM50280291
Substrate/Competitorn/a
Meas. Tech.ChEMBL_88360 (CHEMBL702582)
IC50 195±n/a nM
Citation Sofia, MJSaussyJr., DLJackson, WTMarder, PSilbaugh, SAFroelich, LLCockerham, SLStengel, PW Ortho-alkoxyphenol leukotriene B4 receptor antagonists: effect of a chroman carboxylic acid. Bioorg Med Chem Lett2:1675-1680 (1992)    Article
 
Leukotriene B4 receptor 1/2
Name:Leukotriene B4 receptor 1/2
Synonyms:Leukotriene B4 receptor
Type:n/a
Mol. Mass.:n/a
Description:ASSAY_ID of ChEMBL is 88360
Components:This complex has 2 components.
Component 1
Name:Leukotriene B4 receptor 2
Type:Enzyme Catalytic Domain
Mol. Mass.:37964.86
Organism:Homo sapiens (Human)
Description:Leukotriene 2 0 HUMAN::Q9NPC1
Residue:358
Component 2
Name:Leukotriene B4 receptor 1
Synonyms:BLT BLTR Chemoattractant receptor-like 1 GPR16 LTB4-R 1 Leukotriene B4 R1 Leukotriene B4 receptor 1 P2Y purinoceptor 7 | P2Y7
Type:Enzyme Catalytic Domain
Mol. Mass.:37582.68
Organism:Homo sapiens (Human)
Description:Q15722
Residue:352
BDBM50280291
NameBDBM50280291
Synonyms:7-[3-(4-Ethoxy-2-ethyl-5-hydroxy-phenoxy)-propoxy]-8-propyl-chroman-2-carboxylic acid | CHEMBL416277
TypeSmall organic molecule
Emp. Form.C26H34O7
Mol. Mass.458.544
SMILESCCCc1c(OCCCOc2cc(O)c(OCC)cc2CC)ccc2CCC(Oc12)C(O)=O