Reaction Details
TargetReverse transcriptase/RNaseH
LigandBDBM50050632
Substrate/Competitorn/a
Meas. Tech.ChEMBL_197421 (CHEMBL799810)
IC50 156±n/a nM
Citation Terrett, NTBojanic, DMerson, JRStephenson, PT Imidazo[2′-3′-:6,5]dipyrido[3,2-b:2′,3′-e]-1,4-diazepines: non-nucleoside HIV-1 reverse transcriptase inhibitors with greater enzyme affinity than nevirapine Bioorg Med Chem Lett2:1745-1750 (1992)    Article
 
Reverse transcriptase/RNaseH
Name:Reverse transcriptase/RNaseH
Type:PROTEIN
Mol. Mass.:65229.15
Organism:Human immunodeficiency virus 1
Description:ChEMBL_1473730
Residue:566
BDBM50050632
NameBDBM50050632
Synonyms:8-ETHYL-6-METHOXY-3-METHYL-8H-1,3A,7,8,9-PENTAAZA-DIBENZO[E,H]AZULENE UK-129485
TypeSmall organic molecule
Emp. Form.C17H17N5O
Mol. Mass.307.3498
SMILESCCN1c2ncccc2-c2ncc(C)n2-c2ccc(OC)nc12