Reaction Details
TargetReverse transcriptase/RNaseH
LigandBDBM50280302
Substrate/Competitorn/a
Meas. Tech.ChEBML_197421
IC50 38900±n/a nM
Citation Terrett, NTBojanic, DMerson, JRStephenson, PT Imidazo[2′-3′-:6,5]dipyrido[3,2-b:2′,3′-e]-1,4-diazepines: non-nucleoside HIV-1 reverse transcriptase inhibitors with greater enzyme affinity than nevirapine Bioorg Med Chem Lett2:1745-1750 (1992)    Article
 
Reverse transcriptase/RNaseH
Name:Reverse transcriptase/RNaseH
Type:PROTEIN
Mol. Mass.:65229.15
Organism:Human immunodeficiency virus 1
Description:ChEMBL_1473730
Residue:566
BDBM50280302
NameBDBM50280302
Synonyms:8-Ethyl-3-methyl-8H-1,2,3a,7,8,9-hexaaza-dibenzo[e,h]azulene | CHEMBL299555
TypeSmall organic molecule
Emp. Form.C15H14N6
Mol. Mass.278.3119
SMILESCCN1c2ncccc2-c2nnc(C)n2-c2cccnc12