Reaction Details
TargetReverse transcriptase/RNaseH
LigandBDBM50280303
Substrate/Competitorn/a
Meas. Tech.ChEMBL_197421 (CHEMBL799810)
IC50>100000±n/a nM
Citation Terrett, NTBojanic, DMerson, JRStephenson, PT Imidazo[2′-3′-:6,5]dipyrido[3,2-b:2′,3′-e]-1,4-diazepines: non-nucleoside HIV-1 reverse transcriptase inhibitors with greater enzyme affinity than nevirapine Bioorg Med Chem Lett2:1745-1750 (1992)    Article
 
Reverse transcriptase/RNaseH
Name:Reverse transcriptase/RNaseH
Type:PROTEIN
Mol. Mass.:65229.15
Organism:Human immunodeficiency virus 1
Description:ChEMBL_1473730
Residue:566
BDBM50280303
NameBDBM50280303
Synonyms:(8-Ethyl-8H-1,2,3a,7,8,9-hexaaza-dibenzo[e,h]azulen-3-ylmethyl)-dimethyl-amine | CHEMBL45958
TypeSmall organic molecule
Emp. Form.C17H19N7
Mol. Mass.321.3797
SMILESCCN1c2ncccc2-c2nnc(CN(C)C)n2-c2cccnc12