Reaction Details
TargetReverse transcriptase/RNaseH
LigandBDBM50280315
Substrate/Competitorn/a
Meas. Tech.ChEMBL_197420 (CHEMBL799809)
IC50 5630±n/a nM
Citation Terrett, NTBojanic, DMerson, JRStephenson, PT Imidazo[2′-3′-:6,5]dipyrido[3,2-b:2′,3′-e]-1,4-diazepines: non-nucleoside HIV-1 reverse transcriptase inhibitors with greater enzyme affinity than nevirapine Bioorg Med Chem Lett2:1745-1750 (1992)    Article
 
Reverse transcriptase/RNaseH
Name:Reverse transcriptase/RNaseH
Type:PROTEIN
Mol. Mass.:65229.15
Organism:Human immunodeficiency virus 1
Description:ChEMBL_1473730
Residue:566
BDBM50280315
NameBDBM50280315
Synonyms:3,8-Diethyl-8H-1,3a,7,8,9-pentaaza-dibenzo[e,h]azulene | CHEMBL49334
TypeSmall organic molecule
Emp. Form.C17H17N5
Mol. Mass.291.3504
SMILESCCN1c2ncccc2-c2ncc(CC)n2-c2cccnc12