Reaction Details
TargetReverse transcriptase/RNaseH
LigandBDBM50050633
Substrate/Competitorn/a
Meas. Tech.ChEMBL_197421 (CHEMBL799810)
IC50 245±n/a nM
Citation Terrett, NTBojanic, DMerson, JRStephenson, PT Imidazo[2′-3′-:6,5]dipyrido[3,2-b:2′,3′-e]-1,4-diazepines: non-nucleoside HIV-1 reverse transcriptase inhibitors with greater enzyme affinity than nevirapine Bioorg Med Chem Lett2:1745-1750 (1992)    Article
 
Reverse transcriptase/RNaseH
Name:Reverse transcriptase/RNaseH
Type:PROTEIN
Mol. Mass.:65229.15
Organism:Human immunodeficiency virus 1
Description:ChEMBL_1473730
Residue:566
BDBM50050633
NameBDBM50050633
Synonyms:8-Ethyl-4-methyl-8H-1,3a,7,8,9-pentaaza-dibenzo[e,h]azulene | CHEMBL297982
TypeSmall organic molecule
Emp. Form.C16H15N5
Mol. Mass.277.3238
SMILESCCN1c2ncccc2-c2nccn2-c2c(C)ccnc12