Reaction Details
TargetReverse transcriptase/RNaseH
LigandBDBM50050630
Substrate/Competitorn/a
Meas. Tech.ChEMBL_197420 (CHEMBL799809)
IC50 11500±n/a nM
Citation Terrett, NTBojanic, DMerson, JRStephenson, PT Imidazo[2′-3′-:6,5]dipyrido[3,2-b:2′,3′-e]-1,4-diazepines: non-nucleoside HIV-1 reverse transcriptase inhibitors with greater enzyme affinity than nevirapine Bioorg Med Chem Lett2:1745-1750 (1992)    Article
 
Reverse transcriptase/RNaseH
Name:Reverse transcriptase/RNaseH
Type:PROTEIN
Mol. Mass.:65229.15
Organism:Human immunodeficiency virus 1
Description:ChEMBL_1473730
Residue:566
BDBM50050630
NameBDBM50050630
Synonyms:8-Cyclopropyl-3-methyl-8H-1,2,3a,7,8,9-hexaaza-dibenzo[e,h]azulene | CHEMBL290204
TypeSmall organic molecule
Emp. Form.C16H14N6
Mol. Mass.290.3226
SMILESCc1nnc2-c3cccnc3N(C3CC3)c3ncccc3-n12