Reaction Details
TargetType-1 angiotensin II receptor
LigandBDBM50280322
Substrate/Competitorn/a
Meas. Tech.ChEBML_36160
IC50 200±n/a nM
Citation Murray, WVLalan, PGill, AAddo, MFLewis, JMLee, DKRampulla, RWachter, MPHsi, JDUnderwood, DC Substituted piperidin-2-one biphenyltetrazoles as angiotensin II antagonists Bioorg Med Chem Lett2:1775-1779 (1992)    Article
 
Type-1 angiotensin II receptor
Name:Type-1 angiotensin II receptor
Type:PROTEIN
Mol. Mass.:41107.81
Organism:Bos taurus
Description:ChEMBL_36779
Residue:359
BDBM50280322
NameBDBM50280322
Synonyms:CHEMBL413098 | [4-Methyl-6-oxo-1-[2'-(1H-tetrazol-5-yl)-biphenyl-4-ylmethyl]-piperidin-(2E)-ylidene]-acetic acid ethyl ester
TypeSmall organic molecule
Emp. Form.C24H25N5O3
Mol. Mass.431.487
SMILESCCOC(=O)\C=C1/CC(C)CC(=O)N1Cc1ccc(cc1)-c1ccccc1-c1nnn[nH]1