Reaction Details
TargetNeutrophil elastase
LigandBDBM50280338
Substrate/Competitorn/a
Meas. Tech.ChEMBL_96619 (CHEMBL708177)
Ki 17500±n/a nM
Citation Groutas, WCBrubaker, MJVenkataraman, REpp, JBHouser-Archield, NChong, LSMcClenahan, JJ Potential mechanism-based inhibitors of proteolytic enzymes Bioorg Med Chem Lett2:175-180 (1992)    Article
 
Neutrophil elastase
Name:Neutrophil elastase
Type:Enzyme
Mol. Mass.:28532.38
Organism:Homo sapiens (Human)
Description:P08246
Residue:267
BDBM50280338
NameBDBM50280338
Synonyms:2-((S)-3-Amino-5-methyl-2-oxo-hexyl)-isoindole-1,3-dione; hydrochloride | CHEMBL542119
TypeSmall organic molecule
Emp. Form.C15H18N2O3
Mol. Mass.274.315
SMILESCC(C)C[C@H](N)C(=O)CN1C(=O)c2ccccc2C1=O