Reaction Details
TargetAcyl-CoA:cholesterol acyltransferase
LigandBDBM50051901
Substrate/Competitorn/a
Meas. Tech.ChEMBL_28184 (CHEMBL639301)
IC50 40±n/a nM
Citation Ashton, MJBridge, AWBush, RCDron, DIHarris, NVJones, GDLythgoe, DJRiddell, DSmith, C RP 70676: A potent systematically available inhibitor of acyl-CoA:cholesterol O-acyl transferase (ACAT) Bioorg Med Chem Lett2:375-380 (1992)    Article
 
Acyl-CoA:cholesterol acyltransferase
Name:Acyl-CoA:cholesterol acyltransferase
Synonyms:ACAT
Type:n/a
Mol. Mass.:35405.31
Organism:Oryctolagus cuniculus
Description:n/a
Residue:305
BDBM50051901
NameBDBM50051901
TypeSmall organic molecule
Emp. Form.C25H28N4S
Mol. Mass.416.582
SMILESCc1cc(C)n(CCCCCSc2nc(c([nH]2)-c2ccccc2)-c2ccccc2)n1